Reaction Details
TargetProteinase-activated receptor 1
LigandBDBM50446340
Substrate/Competitorn/a
Meas. Tech.ChEMBL_1286966 (CHEMBL3111131)
Ki 14±n/a nM
Citation Chelliah, MVChackalamannil, SXia, YGreenlee, WJAhn, HSKurowski, SBoykow, GHsieh, YChintala, M Himbacine-derived thrombin receptor antagonists: c7-aminomethyl and c9a-hydroxy analogues of vorapaxar. ACS Med Chem Lett5:183-7 (2014) 
 
Proteinase-activated receptor 1
Name:Proteinase-activated receptor 1
Type:Protein
Mol. Mass.:47450.07
Organism:Homo sapiens (Human)
Description:P25116
Residue:425
BDBM50446340
NameBDBM50446340
Synonyms:CHEMBL3109582
TypeSmall organic molecule
Emp. Form.C30H35FN2O4
Mol. Mass.506.6083
SMILESCCOC(=O)NC[C@@H]1CC[C@@H]2[C@H](C[C@@H]3[C@@H]([C@@H](C)OC3=O)[C@H]2C=Cc2ccc(cn2)-c2cccc(F)c2)C1