Reaction Details
TargetProteinase-activated receptor 1
LigandBDBM50446343
Substrate/Competitorn/a
Meas. Tech.ChEMBL_1286966 (CHEMBL3111131)
Ki 20±n/a nM
Citation Chelliah, MVChackalamannil, SXia, YGreenlee, WJAhn, HSKurowski, SBoykow, GHsieh, YChintala, M Himbacine-derived thrombin receptor antagonists: c7-aminomethyl and c9a-hydroxy analogues of vorapaxar. ACS Med Chem Lett5:183-7 (2014) 
 
Proteinase-activated receptor 1
Name:Proteinase-activated receptor 1
Type:Protein
Mol. Mass.:47450.07
Organism:Homo sapiens (Human)
Description:P25116
Residue:425
BDBM50446343
NameBDBM50446343
Synonyms:CHEMBL3109580
TypeSmall organic molecule
Emp. Form.C27H31FN2O2
Mol. Mass.434.5456
SMILESC[C@H]1OC(=O)[C@@H]2C[C@@H]3C[C@H](CN)CC[C@H]3[C@H](\C=C\c3ccc(cn3)-c3cccc(F)c3)[C@H]12