Reaction Details
TargetHistone-lysine N-methyltransferase EHMT1
LigandBDBM50446376
Substrate/Competitorn/a
Meas. Tech.ChEMBL_1287094 (CHEMBL3111724)
IC50 38±n/a nM
Citation Sweis, RFPliushchev, MBrown, PJGuo, JLi, FMaag, DPetros, AMSoni, NBTse, CVedadi, MMichaelides, MRChiang, GGPappano, WN Discovery and development of potent and selective inhibitors of histone methyltransferase g9a. ACS Med Chem Lett5:205-9 (2014) 
 
Histone-lysine N-methyltransferase EHMT1
Name:Histone-lysine N-methyltransferase EHMT1
Type:PROTEIN
Mol. Mass.:141443.67
Organism:Homo sapiens (Human)
Description:ChEMBL_1450367
Residue:1298
BDBM50446376
NameBDBM50446376
Synonyms:CHEMBL3109630
TypeSmall organic molecule
Emp. Form.C19H27N3O2
Mol. Mass.329.4366
SMILESCOc1cc2c(cc1OCCCN1CCCC1)N=C(N)C21CCC1