Reaction Details
TargetComplement factor D
LigandBDBM50446395
Substrate/Competitorn/a
Meas. Tech.ChEMBL_1287129 (CHEMBL3111918)
IC50 6.0±n/a nM
Citation Abdel-Magid, AF Inhibitors of factor d may provide a treatment for age-related macular degeneration. ACS Med Chem Lett5:106-7 (2014) 
 
Complement factor D
Name:Complement factor D
Type:Protein
Mol. Mass.:27039.19
Organism:Homo sapiens (Human)
Description:P00746
Residue:253
BDBM50446395
NameBDBM50446395
Synonyms:CHEMBL3109653
TypeSmall organic molecule
Emp. Form.C23H22F3N7O3
Mol. Mass.501.4611
SMILESCc1cc2c(nn(CC(=O)N3[C@@H]4C[C@@H]4C[C@H]3C(=O)Nc3cccc(n3)C(F)(F)F)c2c(C)n1)C(N)=O