Reaction Details
TargetComplement factor D
LigandBDBM50446397
Substrate/Competitorn/a
Meas. Tech.ChEMBL_1287129 (CHEMBL3111918)
IC50 2.0±n/a nM
Citation Abdel-Magid, AF Inhibitors of factor d may provide a treatment for age-related macular degeneration. ACS Med Chem Lett5:106-7 (2014) 
 
Complement factor D
Name:Complement factor D
Type:Protein
Mol. Mass.:27039.19
Organism:Homo sapiens (Human)
Description:P00746
Residue:253
BDBM50446397
NameBDBM50446397
Synonyms:CHEMBL3109655
TypeSmall organic molecule
Emp. Form.C21H19BrFN7O3
Mol. Mass.516.323
SMILESNC(=O)c1nn(CC(=O)N2[C@@H]3C[C@@H]3C[C@H]2C(=O)Nc2cccc(Br)n2)c2cnc(CF)cc12