Reaction Details
TargetPolyunsaturated fatty acid lipoxygenase ALOX15
LigandBDBM50446412
Substrate/Competitorn/a
Meas. Tech.ChEMBL_1287332 (CHEMBL3111162)
IC50>10000±n/a nM
Citation Filosa, RPeduto, AAparoy, PSchaible, AMLuderer, SKrauth, VPetronzi, CMassa, Ade Rosa, MReddanna, PWerz, O Discovery and biological evaluation of novel 1,4-benzoquinone and related resorcinol derivatives that inhibit 5-lipoxygenase. Eur J Med Chem67:269-79 (2013) 
 
Polyunsaturated fatty acid lipoxygenase ALOX15
Name:Polyunsaturated fatty acid lipoxygenase ALOX15
Type:Protein
Mol. Mass.:74804.05
Organism:Homo sapiens (Human)
Description:n/a
Residue:662
BDBM50446412
NameBDBM50446412
Synonyms:CHEMBL3109718
TypeSmall organic molecule
Emp. Form.C12H16O3
Mol. Mass.208.2536
SMILESCCCCC=Cc1cc(O)c(O)cc1O