Reaction Details
TargetPolyunsaturated fatty acid 5-lipoxygenase
LigandBDBM50446408
Substrate/Competitorn/a
Meas. Tech.ChEMBL_1287338 (CHEMBL3111168)
IC50>10000±n/a nM
Citation Filosa, RPeduto, AAparoy, PSchaible, AMLuderer, SKrauth, VPetronzi, CMassa, Ade Rosa, MReddanna, PWerz, O Discovery and biological evaluation of novel 1,4-benzoquinone and related resorcinol derivatives that inhibit 5-lipoxygenase. Eur J Med Chem67:269-79 (2013) 
 
Polyunsaturated fatty acid 5-lipoxygenase
Name:Polyunsaturated fatty acid 5-lipoxygenase
Type:Enzyme
Mol. Mass.:77972.74
Organism:Homo sapiens (Human)
Description:Recombinant protein was purified from E. coli lysate. After ammonium sulfate precipitation and subsequent steps, the supernatant (S100) was used for 5-LO activity assay.
Residue:674
BDBM50446408
NameBDBM50446408
Synonyms:CHEMBL3109727
TypeSmall organic molecule
Emp. Form.C14H12O4
Mol. Mass.244.2427
SMILESCOC1=CC(=O)C(=O)C(Cc2ccccc2)C1=O