Reaction Details
TargetPolyunsaturated fatty acid 5-lipoxygenase
LigandBDBM50446410
Substrate/Competitorn/a
Meas. Tech.ChEMBL_1287338 (CHEMBL3111168)
IC50 2300±n/a nM
Citation Filosa, RPeduto, AAparoy, PSchaible, AMLuderer, SKrauth, VPetronzi, CMassa, Ade Rosa, MReddanna, PWerz, O Discovery and biological evaluation of novel 1,4-benzoquinone and related resorcinol derivatives that inhibit 5-lipoxygenase. Eur J Med Chem67:269-79 (2013) 
 
Polyunsaturated fatty acid 5-lipoxygenase
Name:Polyunsaturated fatty acid 5-lipoxygenase
Type:Enzyme
Mol. Mass.:77972.74
Organism:Homo sapiens (Human)
Description:Recombinant protein was purified from E. coli lysate. After ammonium sulfate precipitation and subsequent steps, the supernatant (S100) was used for 5-LO activity assay.
Residue:674
BDBM50446410
NameBDBM50446410
Synonyms:CHEMBL3109722
TypeSmall organic molecule
Emp. Form.C17H14O2
Mol. Mass.250.2919
SMILESOc1ccc(Cc2ccc3ccccc3c2)c(O)c1