Reaction Details
TargetPolyunsaturated fatty acid 5-lipoxygenase
LigandBDBM50446402
Substrate/Competitorn/a
Meas. Tech.ChEMBL_1287338 (CHEMBL3111168)
IC50 6800±n/a nM
Citation Filosa, RPeduto, AAparoy, PSchaible, AMLuderer, SKrauth, VPetronzi, CMassa, Ade Rosa, MReddanna, PWerz, O Discovery and biological evaluation of novel 1,4-benzoquinone and related resorcinol derivatives that inhibit 5-lipoxygenase. Eur J Med Chem67:269-79 (2013) 
 
Polyunsaturated fatty acid 5-lipoxygenase
Name:Polyunsaturated fatty acid 5-lipoxygenase
Type:Enzyme
Mol. Mass.:77972.74
Organism:Homo sapiens (Human)
Description:Recombinant protein was purified from E. coli lysate. After ammonium sulfate precipitation and subsequent steps, the supernatant (S100) was used for 5-LO activity assay.
Residue:674
BDBM50446402
NameBDBM50446402
Synonyms:CHEMBL3109726
TypeSmall organic molecule
Emp. Form.C18H14O3
Mol. Mass.278.302
SMILESOc1ccc(C(=O)Cc2ccc3ccccc3c2)c(O)c1