Reaction Details
TargetPolyunsaturated fatty acid 5-lipoxygenase
LigandBDBM50446413
Substrate/Competitorn/a
Meas. Tech.ChEMBL_1287330 (CHEMBL3111160)
IC50 970±n/a nM
Citation Filosa, RPeduto, AAparoy, PSchaible, AMLuderer, SKrauth, VPetronzi, CMassa, Ade Rosa, MReddanna, PWerz, O Discovery and biological evaluation of novel 1,4-benzoquinone and related resorcinol derivatives that inhibit 5-lipoxygenase. Eur J Med Chem67:269-79 (2013) 
 
Polyunsaturated fatty acid 5-lipoxygenase
Name:Polyunsaturated fatty acid 5-lipoxygenase
Type:Enzyme
Mol. Mass.:77972.74
Organism:Homo sapiens (Human)
Description:Recombinant protein was purified from E. coli lysate. After ammonium sulfate precipitation and subsequent steps, the supernatant (S100) was used for 5-LO activity assay.
Residue:674
BDBM50446413
NameBDBM50446413
Synonyms:CHEMBL1668217
TypeSmall organic molecule
Emp. Form.C17H12O3
Mol. Mass.264.2754
SMILESO=C1CC(=O)C(Cc2ccc3ccccc3c2)=CC1=O