Reaction Details
TargetDual specificity protein kinase TTK
LigandBDBM50446440
Substrate/Competitorn/a
Meas. Tech.ChEMBL_1287777 (CHEMBL3111609)
IC50 2500±n/a nM
Citation Naud, SWestwood, IMFaisal, ASheldrake, PBavetsias, VAtrash, BCheung, KMLiu, MHayes, ASchmitt, JWood, AChoi, VBoxall, KMak, GGurden, MValenti, Mde Haven Brandon, AHenley, ABaker, RMcAndrew, CMatijssen, BBurke, RHoelder, SEccles, SARaynaud, FILinardopoulos, Svan Montfort, RLBlagg, J Structure-based design of orally bioavailable 1H-pyrrolo[3,2-c]pyridine inhibitors of mitotic kinase monopolar spindle 1 (MPS1). J Med Chem56:10045-65 (2013) 
 
Dual specificity protein kinase TTK
Name:Dual specificity protein kinase TTK
Type:Protein
Mol. Mass.:97086.79
Organism:Homo sapiens (Human)
Description:P33981
Residue:857
BDBM50446440
NameBDBM50446440
Synonyms:CHEMBL3109943
TypeSmall organic molecule
Emp. Form.C26H26ClN7O2
Mol. Mass.503.983
SMILESCn1ccc(n1)-c1ccc(Nc2cc3n(C(=O)OC(C)(C)C)c(cc3cn2)-c2cnn(C)c2)c(Cl)c1