Reaction Details
TargetDual specificity protein kinase TTK
LigandBDBM50446445
Substrate/Competitorn/a
Meas. Tech.ChEMBL_1287777 (CHEMBL3111609)
IC50 720±n/a nM
Citation Naud, SWestwood, IMFaisal, ASheldrake, PBavetsias, VAtrash, BCheung, KMLiu, MHayes, ASchmitt, JWood, AChoi, VBoxall, KMak, GGurden, MValenti, Mde Haven Brandon, AHenley, ABaker, RMcAndrew, CMatijssen, BBurke, RHoelder, SEccles, SARaynaud, FILinardopoulos, Svan Montfort, RLBlagg, J Structure-based design of orally bioavailable 1H-pyrrolo[3,2-c]pyridine inhibitors of mitotic kinase monopolar spindle 1 (MPS1). J Med Chem56:10045-65 (2013) 
 
Dual specificity protein kinase TTK
Name:Dual specificity protein kinase TTK
Type:Protein
Mol. Mass.:97086.79
Organism:Homo sapiens (Human)
Description:P33981
Residue:857
BDBM50446445
NameBDBM50446445
Synonyms:CHEMBL2140523
TypeSmall organic molecule
Emp. Form.C24H32N6O3
Mol. Mass.452.5493
SMILESCOc1cc(OC2CCN(C)CC2)ccc1Nc1ncc2n(C)c(=O)n(C3CCCC3)c2n1