Reaction Details
TargetDual specificity protein kinase TTK
LigandBDBM50446462
Substrate/Competitorn/a
Meas. Tech.ChEMBL_1287775 (CHEMBL3111607)
IC50 20±n/a nM
Citation Naud, SWestwood, IMFaisal, ASheldrake, PBavetsias, VAtrash, BCheung, KMLiu, MHayes, ASchmitt, JWood, AChoi, VBoxall, KMak, GGurden, MValenti, Mde Haven Brandon, AHenley, ABaker, RMcAndrew, CMatijssen, BBurke, RHoelder, SEccles, SARaynaud, FILinardopoulos, Svan Montfort, RLBlagg, J Structure-based design of orally bioavailable 1H-pyrrolo[3,2-c]pyridine inhibitors of mitotic kinase monopolar spindle 1 (MPS1). J Med Chem56:10045-65 (2013) 
 
Dual specificity protein kinase TTK
Name:Dual specificity protein kinase TTK
Type:Protein
Mol. Mass.:97086.79
Organism:Homo sapiens (Human)
Description:P33981
Residue:857
BDBM50446462
NameBDBM50446462
Synonyms:CHEMBL3109956
TypeSmall organic molecule
Emp. Form.C17H14ClN5O
Mol. Mass.339.779
SMILESCOc1ccc(Nc2cc3[nH]c(cc3cn2)-c2cn[nH]c2)c(Cl)c1