Reaction Details
TargetAurora kinase B
LigandBDBM50446463
Substrate/Competitorn/a
Meas. Tech.ChEMBL_1287773 (CHEMBL3111605)
IC50>100000±n/a nM
Citation Naud, SWestwood, IMFaisal, ASheldrake, PBavetsias, VAtrash, BCheung, KMLiu, MHayes, ASchmitt, JWood, AChoi, VBoxall, KMak, GGurden, MValenti, Mde Haven Brandon, AHenley, ABaker, RMcAndrew, CMatijssen, BBurke, RHoelder, SEccles, SARaynaud, FILinardopoulos, Svan Montfort, RLBlagg, J Structure-based design of orally bioavailable 1H-pyrrolo[3,2-c]pyridine inhibitors of mitotic kinase monopolar spindle 1 (MPS1). J Med Chem56:10045-65 (2013) 
 
Aurora kinase B
Name:Aurora kinase B
Type:Protein
Mol. Mass.:39327.72
Organism:Homo sapiens (Human)
Description:Q96GD4
Residue:344
BDBM50446463
NameBDBM50446463
Synonyms:CHEMBL3109970
TypeSmall organic molecule
Emp. Form.C24H25ClN6O2
Mol. Mass.464.947
SMILESCOC1CCN(CC1)C(=O)c1ccc(Nc2cc3[nH]c(cc3cn2)-c2cnn(C)c2)c(Cl)c1