Reaction Details
TargetAurora kinase B
LigandBDBM50446457
Substrate/Competitorn/a
Meas. Tech.ChEMBL_1287773 (CHEMBL3111605)
IC50>100000±n/a nM
Citation Naud, SWestwood, IMFaisal, ASheldrake, PBavetsias, VAtrash, BCheung, KMLiu, MHayes, ASchmitt, JWood, AChoi, VBoxall, KMak, GGurden, MValenti, Mde Haven Brandon, AHenley, ABaker, RMcAndrew, CMatijssen, BBurke, RHoelder, SEccles, SARaynaud, FILinardopoulos, Svan Montfort, RLBlagg, J Structure-based design of orally bioavailable 1H-pyrrolo[3,2-c]pyridine inhibitors of mitotic kinase monopolar spindle 1 (MPS1). J Med Chem56:10045-65 (2013) 
 
Aurora kinase B
Name:Aurora kinase B
Type:Protein
Mol. Mass.:39327.72
Organism:Homo sapiens (Human)
Description:Q96GD4
Residue:344
BDBM50446457
NameBDBM50446457
Synonyms:CHEMBL3109966
TypeSmall organic molecule
Emp. Form.C17H14ClN5
Mol. Mass.323.78
SMILESCn1cc(cn1)-c1cc2cnc(Nc3ccccc3Cl)cc2[nH]1