Reaction Details
TargetGTPase KRas
LigandBDBM29608
Substrate/Competitorn/a
Meas. Tech.ChEMBL_1287898 (CHEMBL3112317)
Kd 600000±n/a nM
Citation Schöpel, MJockers, KFDüppe, PMAutzen, JPotheraveedu, VNInce, SYip, KTHeumann, RHerrmann, CScherkenbeck, JStoll, R Bisphenol A binds to Ras proteins and competes with guanine nucleotide exchange: implications for GTPase-selective antagonists. J Med Chem56:9664-72 (2014) 
 
GTPase KRas
Name:GTPase KRas
Type:PROTEIN
Mol. Mass.:21656.10
Organism:Homo sapiens (Human)
Description:ChEMBL_1476955
Residue:189
BDBM29608
NameBDBM29608
Synonyms:Bisphenol A (BPA) US9688816, L
TypeSmall organic molecule
Emp. Form.C15H16O2
Mol. Mass.228.2863
SMILESCC(C)(c1ccc(O)cc1)c1ccc(O)cc1