Reaction Details
TargetNeuronal acetylcholine receptor subunit alpha-3/beta-4
LigandBDBM50446487
Substrate/Competitorn/a
Meas. Tech.ChEMBL_1287913 (CHEMBL3112332)
Ki 20400±n/a nM
Citation Wu, JZhang, YMaida, LESantos, RGWelmaker, GSLaVoi, TMNefzi, AYu, YHoughten, RAToll, LGiulianotti, MA Scaffold ranking and positional scanning utilized in the discovery of nAChR-selective compounds suitable for optimization studies. J Med Chem56:10103-17 (2013) 
 
Neuronal acetylcholine receptor subunit alpha-3/beta-4
Name:Neuronal acetylcholine receptor subunit alpha-3/beta-4
Type:Protein
Mol. Mass.:n/a
Description:n/a
Components:This complex has 2 components.
Component 1
Name:Neuronal acetylcholine receptor subunit alpha-3
Synonyms:ACHA3_RAT Chrna3
Type:Enzyme
Mol. Mass.:56995.52
Organism:Rattus norvegicus (Rat)
Description:P04757
Residue:499
Component 2
Name:Neuronal acetylcholine receptor subunit beta-4
Synonyms:ACHB4_RAT Chrnb4 Neuronal acetylcholine receptor non-alpha-2 chain | Neuronal acetylcholine receptor protein beta-4 subunit
Type:Enzyme
Mol. Mass.:55863.89
Organism:Rattus norvegicus (Rat)
Description:P12392
Residue:495
BDBM50446487
NameBDBM50446487
Synonyms:CHEMBL3110037
TypeSmall organic molecule
Emp. Form.C33H40BrFN6
Mol. Mass.619.613
SMILESNC1=NC[C@H](CCCCN2C[C@@H](Cc3ccccc3)N(CCc3cccc(Br)c3)C2=N)N1CCc1cccc(F)c1