Reaction Details
TargetClathrin heavy chain 1
LigandBDBM50446541
Substrate/Competitorn/a
Meas. Tech.ChEMBL_1286508 (CHEMBL3110376)
IC50 100000±n/a nM
Citation MacGregor, KARobertson, MJYoung, KAvon Kleist, LStahlschmidt, WWhiting, AChau, NRobinson, PJHaucke, VMcCluskey, A Development of 1,8-naphthalimides as clathrin inhibitors. J Med Chem57:131-43 (2014) 
 
Clathrin heavy chain 1
Name:Clathrin heavy chain 1
Type:PROTEIN
Mol. Mass.:191588.72
Organism:Homo sapiens (Human)
Description:ChEMBL_107994
Residue:1675
BDBM50446541
NameBDBM50446541
Synonyms:CHEMBL3110185
TypeSmall organic molecule
Emp. Form.C21H17N2O5S
Mol. Mass.409.436
SMILESCN(C)c1ccc(CN2C(=O)c3cccc4cc(cc(C2=O)c34)S([O-])(=O)=O)cc1