Reaction Details
TargetClathrin heavy chain 1
LigandBDBM50446549
Substrate/Competitorn/a
Meas. Tech.ChEMBL_1286508 (CHEMBL3110376)
IC50 10000±n/a nM
Citation MacGregor, KARobertson, MJYoung, KAvon Kleist, LStahlschmidt, WWhiting, AChau, NRobinson, PJHaucke, VMcCluskey, A Development of 1,8-naphthalimides as clathrin inhibitors. J Med Chem57:131-43 (2014) 
 
Clathrin heavy chain 1
Name:Clathrin heavy chain 1
Type:PROTEIN
Mol. Mass.:191588.72
Organism:Homo sapiens (Human)
Description:ChEMBL_107994
Residue:1675
BDBM50446549
NameBDBM50446549
Synonyms:CHEMBL3110180
TypeSmall organic molecule
Emp. Form.C19H13N2O5S
Mol. Mass.381.382
SMILESNc1ccccc1CN1C(=O)c2cccc3cc(cc(C1=O)c23)S([O-])(=O)=O