Reaction Details
TargetClathrin heavy chain 1
LigandBDBM50446552
Substrate/Competitorn/a
Meas. Tech.ChEMBL_1286508 (CHEMBL3110376)
IC50 100000±n/a nM
Citation MacGregor, KARobertson, MJYoung, KAvon Kleist, LStahlschmidt, WWhiting, AChau, NRobinson, PJHaucke, VMcCluskey, A Development of 1,8-naphthalimides as clathrin inhibitors. J Med Chem57:131-43 (2014) 
 
Clathrin heavy chain 1
Name:Clathrin heavy chain 1
Type:PROTEIN
Mol. Mass.:191588.72
Organism:Homo sapiens (Human)
Description:ChEMBL_107994
Residue:1675
BDBM50446552
NameBDBM50446552
Synonyms:CHEMBL3110162
TypeSmall organic molecule
Emp. Form.C19H10N2O7
Mol. Mass.378.2919
SMILESOC(=O)c1cc(O)ccc1N1C(=O)c2cccc3cc(cc(C1=O)c23)[N+]([O-])=O