Reaction Details
TargetClathrin heavy chain 1
LigandBDBM50446553
Substrate/Competitorn/a
Meas. Tech.ChEMBL_1286508 (CHEMBL3110376)
IC50 80000±n/a nM
Citation MacGregor, KARobertson, MJYoung, KAvon Kleist, LStahlschmidt, WWhiting, AChau, NRobinson, PJHaucke, VMcCluskey, A Development of 1,8-naphthalimides as clathrin inhibitors. J Med Chem57:131-43 (2014) 
 
Clathrin heavy chain 1
Name:Clathrin heavy chain 1
Type:PROTEIN
Mol. Mass.:191588.72
Organism:Homo sapiens (Human)
Description:ChEMBL_107994
Residue:1675
BDBM50446553
NameBDBM50446553
Synonyms:CHEMBL3110161
TypeSmall organic molecule
Emp. Form.C19H10N2O7
Mol. Mass.378.2919
SMILESOC(=O)c1ccc(N2C(=O)c3cccc4cc(cc(C2=O)c34)[N+]([O-])=O)c(O)c1