Reaction Details
TargetTransient receptor potential cation channel subfamily M member 2
LigandBDBM50446558
Substrate/Competitorn/a
Meas. Tech.ChEMBL_1286614 (CHEMBL3111089)
IC50 100000±n/a nM
Citation Moreau, CKirchberger, TSwarbrick, JMBartlett, SJFliegert, RYorgan, TBauche, AHarneit, AGuse, AHPotter, BV Structure-activity relationship of adenosine 5'-diphosphoribose at the transient receptor potential melastatin 2 (TRPM2) channel: rational design of antagonists. J Med Chem56:10079-102 (2013) 
 
Transient receptor potential cation channel subfamily M member 2
Name:Transient receptor potential cation channel subfamily M member 2
Type:PROTEIN
Mol. Mass.:171218.39
Organism:Homo sapiens (Human)
Description:ChEMBL_103516
Residue:1503
BDBM50446558
NameBDBM50446558
Synonyms:CHEMBL3110195
TypeSmall organic molecule
Emp. Form.C14H23N5O11P2
Mol. Mass.499.3068
SMILESNc1ncnc2n(CCCCOP(O)(=O)OP(O)(=O)OC[C@H]3OC(O)[C@H](O)[C@@H]3O)cnc12