Reaction Details
TargetSerine/threonine-protein kinase N1
LigandBDBM50446566
Substrate/Competitorn/a
Meas. Tech.ChEMBL_1286355 (CHEMBL3111636)
IC50>100000±n/a nM
Citation Daletos, Gde Voogd, NJMüller, WEWray, VLin, WFeger, DKubbutat, MAly, AHProksch, P Cytotoxic and protein kinase inhibiting nakijiquinones and nakijiquinols from the sponge Dactylospongia metachromia. J Nat Prod77:218-26 (2014) 
 
Serine/threonine-protein kinase N1
Name:Serine/threonine-protein kinase N1
Type:PROTEIN
Mol. Mass.:103928.39
Organism:Homo sapiens (Human)
Description:ChEMBL_1433150
Residue:942
BDBM50446566
NameBDBM50446566
Synonyms:CHEMBL3109401
TypeSmall organic molecule
Emp. Form.C26H39NO3
Mol. Mass.413.5928
SMILESCC(C)CC=Nc1cc(O)c(O)c(C[C@]2(C)[C@@H](C)CC[C@]3(C)[C@H]2CCC=C3C)c1O