Reaction Details
TargetInsulin-like growth factor 1 receptor
LigandBDBM50446565
Substrate/Competitorn/a
Meas. Tech.ChEMBL_1286362 (CHEMBL3111643)
IC50 3310±n/a nM
Citation Daletos, Gde Voogd, NJMüller, WEWray, VLin, WFeger, DKubbutat, MAly, AHProksch, P Cytotoxic and protein kinase inhibiting nakijiquinones and nakijiquinols from the sponge Dactylospongia metachromia. J Nat Prod77:218-26 (2014) 
 
Insulin-like growth factor 1 receptor
Name:Insulin-like growth factor 1 receptor
Type:Protein
Mol. Mass.:154776.79
Organism:Homo sapiens (Human)
Description:P08069
Residue:1367
BDBM50446565
NameBDBM50446565
Synonyms:CHEMBL3109402
TypeSmall organic molecule
Emp. Form.C24H33NO3
Mol. Mass.383.5237
SMILESCOc1cc2nc(C)oc2c(C[C@]2(C)[C@@H](C)CC[C@]3(C)[C@H]2CCC=C3C)c1O