Reaction Details
TargetFocal adhesion kinase 1
LigandBDBM50446564
Substrate/Competitorn/a
Meas. Tech.ChEMBL_1286363 (CHEMBL3111644)
IC50 4560±n/a nM
Citation Daletos, Gde Voogd, NJMüller, WEWray, VLin, WFeger, DKubbutat, MAly, AHProksch, P Cytotoxic and protein kinase inhibiting nakijiquinones and nakijiquinols from the sponge Dactylospongia metachromia. J Nat Prod77:218-26 (2014) 
 
Focal adhesion kinase 1
Name:Focal adhesion kinase 1
Type:Tyrosine-protein kinase
Mol. Mass.:119233.17
Organism:Homo sapiens (Human)
Description:Q05397
Residue:1052
BDBM50446564
NameBDBM50446564
Synonyms:CHEMBL3109404
TypeSmall organic molecule
Emp. Form.C23H32O4
Mol. Mass.372.4978
SMILESCOC(=O)c1cc(O)c(O)c(C[C@]2(C)[C@@H](C)CC[C@]3(C)[C@H]2CCC=C3C)c1