Reaction Details
TargetTransient receptor potential cation channel subfamily M member 8
LigandBDBM50366620
Substrate/Competitorn/a
Meas. Tech.ChEMBL_1286462 (CHEMBL3112194)
IC50>100000±n/a nM
Citation Terada, YHorie, STakayama, HUchida, KTominaga, MWatanabe, T Activation and inhibition of thermosensitive TRP channels by voacangine, an alkaloid present in Voacanga africana, an African tree. J Nat Prod77:285-97 (2014) 
 
Transient receptor potential cation channel subfamily M member 8
Name:Transient receptor potential cation channel subfamily M member 8
Type:PROTEIN
Mol. Mass.:127713.99
Organism:Mus musculus
Description:ChEMBL_107992
Residue:1104
BDBM50366620
NameBDBM50366620
Synonyms:RESINIFERATOXIN
TypeSmall organic molecule
Emp. Form.C37H40O9
Mol. Mass.628.7081
SMILESCOc1cc(CC(=O)OCC2=C[C@H]3[C@H]4OC5(Cc6ccccc6)O[C@@]4(C[C@@H](C)[C@]3(O5)[C@@H]3C=C(C)C(=O)[C@@]3(O)C2)C(C)=C)ccc1O