Reaction Details
TargetTransient receptor potential cation channel subfamily V member 1
LigandBDBM50329104
Substrate/Competitorn/a
Meas. Tech.ChEMBL_1286473 (CHEMBL3112345)
Kd 19953±n/a nM
Citation Terada, YHorie, STakayama, HUchida, KTominaga, MWatanabe, T Activation and inhibition of thermosensitive TRP channels by voacangine, an alkaloid present in Voacanga africana, an African tree. J Nat Prod77:285-97 (2014) 
 
Transient receptor potential cation channel subfamily V member 1
Name:Transient receptor potential cation channel subfamily V member 1
Type:Protein
Mol. Mass.:94960.75
Organism:Homo sapiens (Human)
Description:Q8NER1
Residue:839
BDBM50329104
NameBDBM50329104
Synonyms:CHEMBL182120 voacangine
TypeSmall organic molecule
Emp. Form.C22H28N2O3
Mol. Mass.368.4693
SMILESCC[C@H]1C[C@@H]2CN3CCc4c([nH]c5ccc(OC)cc45)[C@](C2)([C@H]13)C(=O)OC