Reaction Details
TargetArginase
LigandBDBM23417
Substrate/Competitorn/a
Meas. Tech.ChEMBL_1286564 (CHEMBL3110797)
Ki 200±n/a nM
Citation de Sousa, LRRamalho, SDBurger, MCNebo, LFernandes, JBda Silva, MFIemma, MRCorrêa, CJde Souza, DHLima, MIVieira, PC Isolation of arginase inhibitors from the bioactivity-guided fractionation of Byrsonima coccolobifolia leaves and stems. J Nat Prod77:392-6 (2014) 
 
Arginase
Name:Arginase
Synonyms:n/a
Type:PROTEIN
Mol. Mass.:36149.67
Organism:Leishmania amazonensis
Description:ChEMBL_107995
Residue:329
BDBM23417
NameBDBM23417
TypeFlavonol
Emp. Form.C15H14O6
Mol. Mass.290.2681
SMILESO[C@@H]1Cc2c(O)cc(O)cc2O[C@@H]1c1ccc(O)c(O)c1