Reaction Details
TargetArginase
LigandBDBM50446568
Substrate/Competitorn/a
Meas. Tech.ChEMBL_1286564 (CHEMBL3110797)
Ki 3800±n/a nM
Citation de Sousa, LRRamalho, SDBurger, MCNebo, LFernandes, JBda Silva, MFIemma, MRCorrêa, CJde Souza, DHLima, MIVieira, PC Isolation of arginase inhibitors from the bioactivity-guided fractionation of Byrsonima coccolobifolia leaves and stems. J Nat Prod77:392-6 (2014) 
 
Arginase
Name:Arginase
Synonyms:n/a
Type:PROTEIN
Mol. Mass.:36149.67
Organism:Leishmania amazonensis
Description:ChEMBL_107995
Residue:329
BDBM50446568
NameBDBM50446568
Synonyms:CHEMBL3109439
TypeSmall organic molecule
Emp. Form.C21H20O12
Mol. Mass.464.3763
SMILESC[C@H]1O[C@H](Oc2c(O)c3c(cc(O)cc3=O)oc2-c2cc(O)c(O)c(O)c2)[C@@H](O)[C@@H](O)[C@@H]1O