Reaction Details
TargetAcetylcholinesterase
LigandBDBM50446577
Substrate/Competitorn/a
Meas. Tech.ChEMBL_1286854 (CHEMBL3112238)
Ki 90000±n/a nM
Citation Tadesse, MSvenson, JSepcic, KTrembleau, LEngqvist, MAndersen, JHJaspars, MStensvåg, KHaug, T Isolation and synthesis of pulmonarins A and B, acetylcholinesterase inhibitors from the colonial ascidian Synoicum pulmonaria. J Nat Prod77:364-9 (2014) 
 
Acetylcholinesterase
Name:Acetylcholinesterase
Type:Enzyme
Mol. Mass.:71812.79
Organism:Electrophorus electricus (Electric eel)
Description:n/a
Residue:633
BDBM50446577
NameBDBM50446577
Synonyms:CHEMBL3109482
TypeSmall organic molecule
Emp. Form.C13H18Br2NO3
Mol. Mass.396.094
SMILESCOc1c(Br)cc(cc1Br)C(=O)OCC[N+](C)(C)C