Reaction Details
TargetTranscription factor Jun
LigandBDBM50133496
Substrate/Competitorn/a
Meas. Tech.ChEMBL_1290685 (CHEMBL3117488)
IC50 16200±n/a nM
Citation Chen, YSYu, HMShie, JJCheng, TJWu, CYFang, JMWong, CH Chemical constituents of Plectranthus amboinicus and the synthetic analogs possessing anti-inflammatory activity. Bioorg Med Chem22:1766-72 (2014) 
 
Transcription factor Jun
Name:Transcription factor Jun
Type:n/a
Mol. Mass.:35683.24
Organism:Homo sapiens (Human)
Description:P05412
Residue:331
BDBM50133496
NameBDBM50133496
Synonyms:(2R)-3-(3,4-dihydroxyphenyl)-2-[(2E)-3-(3,4-dihydroxyphenyl)prop-2-enoyloxy]propanoic acid CHEMBL324842 US10688093, Compound rosmarinic acid cid_5281792
TypeSmall organic molecule
Emp. Form.C18H16O8
Mol. Mass.360.3148
SMILESOC(=O)[C@@H](Cc1ccc(O)c(O)c1)OC(=O)\C=C\c1ccc(O)c(O)c1