Reaction Details
TargetPolyunsaturated fatty acid 5-lipoxygenase
LigandBDBM50446683
Substrate/Competitorn/a
Meas. Tech.ChEMBL_1290921 (CHEMBL3118894)
Ki 820±n/a nM
Citation Prasher, PPooja, naSingh, P Lead modification: amino acid appended indoles as highly effective 5-LOX inhibitors. Bioorg Med Chem22:1642-8 (2014) 
 
Polyunsaturated fatty acid 5-lipoxygenase
Name:Polyunsaturated fatty acid 5-lipoxygenase
Type:Enzyme
Mol. Mass.:77972.74
Organism:Homo sapiens (Human)
Description:Recombinant protein was purified from E. coli lysate. After ammonium sulfate precipitation and subsequent steps, the supernatant (S100) was used for 5-LO activity assay.
Residue:674
BDBM50446683
NameBDBM50446683
Synonyms:CHEMBL3113615
TypeSmall organic molecule
Emp. Form.C24H24N2O8S
Mol. Mass.500.521
SMILESCOC(=O)CC[C@@H](NC(=O)C(=O)c1cn(c2ccccc12)S(=O)(=O)c1ccc(C)cc1)C(=O)OC