Reaction Details
TargetAmiloride-sensitive amine oxidase [copper-containing]
LigandBDBM50446747
Substrate/Competitorn/a
Meas. Tech.ChEMBL_1288377 (CHEMBL3118035)
IC50>1000000±n/a nM
Citation Lucchesini, FPocci, MAlfei, SBertini, VBuffoni, F Synthesis of 2,6-disubstituted benzylamine derivatives as reversible selective inhibitors of copper amine oxidases. Bioorg Med Chem22:1558-67 (2014) 
 
Amiloride-sensitive amine oxidase [copper-containing]
Name:Amiloride-sensitive amine oxidase [copper-containing]
Type:PROTEIN
Mol. Mass.:85480.30
Organism:Sus scrofa
Description:ChEMBL_107996
Residue:755
BDBM50446747
NameBDBM50446747
Synonyms:CHEMBL3114407
TypeSmall organic molecule
Emp. Form.C11H17NO2
Mol. Mass.195.2582
SMILESCCOc1cccc(OCC)c1CN