Reaction Details
TargetProlyl hydroxylase EGLN2
LigandBDBM50385806
Substrate/Competitorn/a
Meas. Tech.ChEMBL_1290292 (CHEMBL3118614)
IC50 0.200000±n/a nM
Citation Rabinowitz, MH Inhibition of hypoxia-inducible factor prolyl hydroxylase domain oxygen sensors: tricking the body into mounting orchestrated survival and repair responses. J Med Chem56:9369-402 (2014) 
 
Prolyl hydroxylase EGLN2
Name:Prolyl hydroxylase EGLN2
Type:Protein
Mol. Mass.:43657.01
Organism:Homo sapiens (Human)
Description:Q96KS0
Residue:407
BDBM50385806
NameBDBM50385806
Synonyms:CHEMBL2041193
TypeSmall organic molecule
Emp. Form.C32H30N6O4
Mol. Mass.562.6184
SMILESCc1cccnc1CN1CCC2(CC1)N(C(=O)N(C2=O)c1ccc(cc1)-c1ccc(cc1C)C(O)=O)c1ccncn1