Reaction Details
TargetTelomerase reverse transcriptase
LigandBDBM50105463
Substrate/Competitorn/a
Meas. Tech.ChEMBL_1290503 (CHEMBL3119794)
IC50 2100±n/a nM
Citation Wu, XQHuang, CJia, YMSong, BALi, JLiu, XH Novel coumarin-dihydropyrazole thio-ethanone derivatives: design, synthesis and anticancer activity. Eur J Med Chem74:717-25 (2014) 
 
Telomerase reverse transcriptase
Name:Telomerase reverse transcriptase
Type:PROTEIN
Mol. Mass.:127099.03
Organism:Homo sapiens (Human)
Description:ChEMBL_1447029
Residue:1132
BDBM50105463
NameBDBM50105463
Synonyms:2,7-diamino-10-ethyl-9-phenylphenanthridinium bromide 3,8-diamino-5-ethyl-6-phenylphenanthridinium bromide Dromilac Ethidium bromide | Homidium bromide
TypeSmall organic molecule
Emp. Form.C21H20N3
Mol. Mass.314.4031
SMILESCCn1c(-c2ccccc2)c2cc(N)ccc2c2ccc(=[NH2+])cc12