Reaction Details
TargetTyrosine-protein kinase JAK2
LigandBDBM50446985
Substrate/Competitorn/a
Meas. Tech.ChEMBL_1291450 (CHEMBL3118240)
IC50<3±n/a nM
Citation Su, QIoannidis, SChuaqui, CAlmeida, LAlimzhanov, MBebernitz, GBell, KBlock, MHoward, THuang, SHuszar, DRead, JARivard Costa, CShi, JSu, MYe, MZinda, M Discovery of 1-methyl-1H-imidazole derivatives as potent Jak2 inhibitors. J Med Chem57:144-58 (2014) 
 
Tyrosine-protein kinase JAK2
Name:Tyrosine-protein kinase JAK2
Type:Protein
Mol. Mass.:130684.68
Organism:Homo sapiens (Human)
Description:O60674
Residue:1132
BDBM50446985
NameBDBM50446985
Synonyms:CHEMBL3116063
TypeSmall organic molecule
Emp. Form.C17H15ClFN9
Mol. Mass.399.813
SMILESCC(Nc1nc(Nc2cn(C)cn2)c2ccc(Cl)nc2n1)c1ncc(F)cn1