Reaction Details
TargetTyrosine-protein kinase JAK1
LigandBDBM50446983
Substrate/Competitorn/a
Meas. Tech.ChEMBL_1291451 (CHEMBL3118241)
IC50 28±n/a nM
Citation Su, QIoannidis, SChuaqui, CAlmeida, LAlimzhanov, MBebernitz, GBell, KBlock, MHoward, THuang, SHuszar, DRead, JARivard Costa, CShi, JSu, MYe, MZinda, M Discovery of 1-methyl-1H-imidazole derivatives as potent Jak2 inhibitors. J Med Chem57:144-58 (2014) 
 
Tyrosine-protein kinase JAK1
Name:Tyrosine-protein kinase JAK1
Type:Protein
Mol. Mass.:133293.73
Organism:Homo sapiens (Human)
Description:P23458
Residue:1154
BDBM50446983
NameBDBM50446983
Synonyms:CHEMBL3116065
TypeSmall organic molecule
Emp. Form.C17H16FN9
Mol. Mass.365.3676
SMILESC[C@H](Nc1nc(Nc2cn(C)cn2)c2ccncc2n1)c1ncc(F)cn1