Reaction Details
TargetTyrosine-protein kinase JAK2
LigandBDBM50446987
Substrate/Competitorn/a
Meas. Tech.ChEMBL_1291450 (CHEMBL3118240)
IC50 33±n/a nM
Citation Su, QIoannidis, SChuaqui, CAlmeida, LAlimzhanov, MBebernitz, GBell, KBlock, MHoward, THuang, SHuszar, DRead, JARivard Costa, CShi, JSu, MYe, MZinda, M Discovery of 1-methyl-1H-imidazole derivatives as potent Jak2 inhibitors. J Med Chem57:144-58 (2014) 
 
Tyrosine-protein kinase JAK2
Name:Tyrosine-protein kinase JAK2
Type:Protein
Mol. Mass.:130684.68
Organism:Homo sapiens (Human)
Description:O60674
Residue:1132
BDBM50446987
NameBDBM50446987
Synonyms:CHEMBL3116061
TypeSmall organic molecule
Emp. Form.C17H16FN9
Mol. Mass.365.3676
SMILESCC(Nc1nc(Nc2cn(C)cn2)c2cccnc2n1)c1ncc(F)cn1