Reaction Details
TargetCholinesterase
LigandBDBM50447018
Substrate/Competitorn/a
Meas. Tech.ChEMBL_1289180 (CHEMBL3119242)
IC50>10000±n/a nM
Citation González-Naranjo, PPérez-Macias, NCampillo, NEPérez, CArán, VJGirón, RSánchez-Robles, EMartín, MIGómez-Cañas, MGarcía-Arencibia, MFernández-Ruiz, JPáez, JA Cannabinoid agonists showing BuChE inhibition as potential therapeutic agents for Alzheimer's disease. Eur J Med Chem73:56-72 (2014) 
 
Cholinesterase
Name:Cholinesterase
Type:Enzyme
Mol. Mass.:65643.35
Organism:Equus caballus (Horse)
Description:P81908
Residue:574
BDBM50447018
NameBDBM50447018
Synonyms:CHEMBL3116296
TypeSmall organic molecule
Emp. Form.C25H19N3O3
Mol. Mass.409.4367
SMILES[O-][N+](=O)c1ccc2n(Cc3ccccc3)nc(OCc3ccc4ccccc4c3)c2c1