Reaction Details
TargetCholinesterase
LigandBDBM50447029
Substrate/Competitorn/a
Meas. Tech.ChEMBL_1289180 (CHEMBL3119242)
IC50>10000±n/a nM
Citation González-Naranjo, PPérez-Macias, NCampillo, NEPérez, CArán, VJGirón, RSánchez-Robles, EMartín, MIGómez-Cañas, MGarcía-Arencibia, MFernández-Ruiz, JPáez, JA Cannabinoid agonists showing BuChE inhibition as potential therapeutic agents for Alzheimer's disease. Eur J Med Chem73:56-72 (2014) 
 
Cholinesterase
Name:Cholinesterase
Type:Enzyme
Mol. Mass.:65643.35
Organism:Equus caballus (Horse)
Description:P81908
Residue:574
BDBM50447029
NameBDBM50447029
Synonyms:CHEMBL3116281
TypeSmall organic molecule
Emp. Form.C23H22N2O3
Mol. Mass.374.4324
SMILESCOc1ccc(COc2nn(Cc3ccc(OC)cc3)c3ccccc23)cc1