Reaction Details
TargetAldehyde dehydrogenase, dimeric NADP-preferring
LigandBDBM62312
Substrate/Competitorn/a
Meas. Tech.ChEMBL_1289633 (CHEMBL3118331)
IC50 700±n/a nM
Citation Parajuli, BFishel, MLHurley, TD Selective ALDH3A1 inhibition by benzimidazole analogues increase mafosfamide sensitivity in cancer cells. J Med Chem57:449-61 (2014) 
 
Aldehyde dehydrogenase, dimeric NADP-preferring
Name:Aldehyde dehydrogenase, dimeric NADP-preferring
Type:Protein
Mol. Mass.:50394.38
Organism:Homo sapiens (Human)
Description:n/a
Residue:453
BDBM62312
NameBDBM62312
Synonyms:2-methyl-1-(4-methylphenyl)sulfonyl-benzimidazole 2-methyl-1-tosyl-benzimidazole US9328112, A10 | cid_755364
TypeSmall organic molecule
Emp. Form.C15H14N2O2S
Mol. Mass.286.349
SMILESCc1nc2ccccc2n1S(=O)(=O)c1ccc(C)cc1