Reaction Details
TargetBotulinum neurotoxin type A
LigandBDBM50447105
Substrate/Competitorn/a
Meas. Tech.ChEMBL_1290079 (CHEMBL3117199)
IC50 800±n/a nM
Citation Caglic, DKrutein, MCBompiani, KMBarlow, DJBenoni, GPelletier, JCReitz, ABLairson, LLHouseknecht, KLSmith, GRDickerson, TJ Identification of clinically viable quinolinol inhibitors of botulinum neurotoxin A light chain. J Med Chem57:669-76 (2014) 
 
Botulinum neurotoxin type A
Name:Botulinum neurotoxin type A
Type:PROTEIN
Mol. Mass.:149450.01
Organism:Clostridium botulinum
Description:ChEMBL_1510137
Residue:1296
BDBM50447105
NameBDBM50447105
Synonyms:CHEMBL3112883
TypeSmall organic molecule
Emp. Form.C23H17ClN2O2
Mol. Mass.388.846
SMILESOc1c(ccc2cccnc12)C(NC(=O)c1ccccc1)c1ccccc1Cl