Reaction Details
TargetBotulinum neurotoxin type A
LigandBDBM50447149
Substrate/Competitorn/a
Meas. Tech.ChEMBL_1290079 (CHEMBL3117199)
IC50 1100±n/a nM
Citation Caglic, DKrutein, MCBompiani, KMBarlow, DJBenoni, GPelletier, JCReitz, ABLairson, LLHouseknecht, KLSmith, GRDickerson, TJ Identification of clinically viable quinolinol inhibitors of botulinum neurotoxin A light chain. J Med Chem57:669-76 (2014) 
 
Botulinum neurotoxin type A
Name:Botulinum neurotoxin type A
Type:PROTEIN
Mol. Mass.:149450.01
Organism:Clostridium botulinum
Description:ChEMBL_1510137
Residue:1296
BDBM50447149
NameBDBM50447149
Synonyms:CHEMBL3112891
TypeSmall organic molecule
Emp. Form.C23H20N4O3
Mol. Mass.400.4299
SMILESCc1ccnc(NC(c2cccc(c2)[N+]([O-])=O)c2ccc3ccc(C)nc3c2O)c1