Reaction Details
TargetRAC-alpha serine/threonine-protein kinase
LigandBDBM50447171
Substrate/Competitorn/a
Meas. Tech.ChEMBL_1290336 (CHEMBL3118849)
IC50 1430±n/a nM
Citation Liu, TZhan, WWang, YZhang, LYang, BDong, XHu, Y Structure-based design, synthesis and biological evaluation of diphenylmethylamine derivatives as novel Akt1 inhibitors. Eur J Med Chem73:167-76 (2014) 
 
RAC-alpha serine/threonine-protein kinase
Name:RAC-alpha serine/threonine-protein kinase
Type:Enzyme
Mol. Mass.:55681.25
Organism:Homo sapiens (Human)
Description:P31749
Residue:480
BDBM50447171
NameBDBM50447171
Synonyms:CHEMBL3113135
TypeSmall organic molecule
Emp. Form.C22H23ClN2
Mol. Mass.350.884
SMILESCC(C)CNC(c1ccc(Cl)cc1)c1ccc(cc1)-c1ccncc1