Reaction Details
TargetRAC-alpha serine/threonine-protein kinase
LigandBDBM15211
Substrate/Competitorn/a
Meas. Tech.ChEMBL_1290336 (CHEMBL3118849)
IC50 1720±n/a nM
Citation Liu, TZhan, WWang, YZhang, LYang, BDong, XHu, Y Structure-based design, synthesis and biological evaluation of diphenylmethylamine derivatives as novel Akt1 inhibitors. Eur J Med Chem73:167-76 (2014) 
 
RAC-alpha serine/threonine-protein kinase
Name:RAC-alpha serine/threonine-protein kinase
Type:Enzyme
Mol. Mass.:55681.25
Organism:Homo sapiens (Human)
Description:P31749
Residue:480
BDBM15211
NameBDBM15211
Synonyms:CHEMBL104264 H89 N-(2-{[(2E)-3-(4-bromophenyl)prop-2-en-1-yl]amino}ethyl)isoquinoline-5-sulfonamide | N-[2-[[(E)-3-(4-bromophenyl)prop-2-enyl]amino]ethyl]isoquinoline-5-sulfonamide
TypeSmall organic molecule
Emp. Form.C20H20BrN3O2S
Mol. Mass.446.361
SMILESBrc1ccc(\C=C\CNCCNS(=O)(=O)c2cccc3cnccc23)cc1