Reaction Details
TargetPolyunsaturated fatty acid lipoxygenase ALOX12
LigandBDBM50447180
Substrate/Competitorn/a
Meas. Tech.ChEMBL_1290553 (CHEMBL3116602)
IC50 220±n/a nM
Citation Luci, DKJameson, JBYasgar, ADiaz, GJoshi, NKantz, AMarkham, KPerry, SKuhn, NYeung, JKerns, EHSchultz, LHolinstat, MNadler, JLTaylor-Fishwick, DAJadhav, ASimeonov, AHolman, TRMaloney, DJ Synthesis and structure-activity relationship studies of 4-((2-hydroxy-3-methoxybenzyl)amino)benzenesulfonamide derivatives as potent and selective inhibitors of 12-lipoxygenase. J Med Chem57:495-506 (2014) 
 
Polyunsaturated fatty acid lipoxygenase ALOX12
Name:Polyunsaturated fatty acid lipoxygenase ALOX12
Type:Protein
Mol. Mass.:75689.18
Organism:Homo sapiens (Human)
Description:P18054
Residue:663
BDBM50447180
NameBDBM50447180
Synonyms:CHEMBL3113198 | US10752581, Compound 68
TypeSmall organic molecule
Emp. Form.C21H18FN3O4S2
Mol. Mass.459.514
SMILESCOc1cccc(CNc2ccc(cc2)S(=O)(=O)Nc2nc3ccc(F)cc3s2)c1O