Reaction Details
TargetPolyunsaturated fatty acid lipoxygenase ALOX12
LigandBDBM50447200
Substrate/Competitorn/a
Meas. Tech.ChEMBL_1290553 (CHEMBL3116602)
IC50 760±n/a nM
Citation Luci, DKJameson, JBYasgar, ADiaz, GJoshi, NKantz, AMarkham, KPerry, SKuhn, NYeung, JKerns, EHSchultz, LHolinstat, MNadler, JLTaylor-Fishwick, DAJadhav, ASimeonov, AHolman, TRMaloney, DJ Synthesis and structure-activity relationship studies of 4-((2-hydroxy-3-methoxybenzyl)amino)benzenesulfonamide derivatives as potent and selective inhibitors of 12-lipoxygenase. J Med Chem57:495-506 (2014) 
 
Polyunsaturated fatty acid lipoxygenase ALOX12
Name:Polyunsaturated fatty acid lipoxygenase ALOX12
Type:Protein
Mol. Mass.:75689.18
Organism:Homo sapiens (Human)
Description:P18054
Residue:663
BDBM50447200
NameBDBM50447200
Synonyms:CHEMBL3113195 | US10752581, Compound 65
TypeSmall organic molecule
Emp. Form.C30H37N3O6S
Mol. Mass.567.696
SMILESCOc1cccc(CNc2ccc(cc2)S(=O)(=O)Nc2cccc(c2)C2CCN(CC2)C(=O)OC(C)(C)C)c1O