Reaction Details
TargetEnoyl-acyl carrier reductase ENR
LigandBDBM50392117
Substrate/Competitorn/a
Meas. Tech.ChEMBL_1290812 (CHEMBL3118190)
IC50>1000±n/a nM
Citation Wilkinson, CMcPhillie, MJZhou, YWoods, SAfanador, GARawson, SKhaliq, FPrigge, STRoberts, CWRice, DWMcLeod, RFishwick, CWMuench, SP The benzimidazole based drugs show good activity against T. gondii but poor activity against its proposed enoyl reductase enzyme target. Bioorg Med Chem Lett24:911-6 (2014) 
 
Enoyl-acyl carrier reductase ENR
Name:Enoyl-acyl carrier reductase ENR
Type:PROTEIN
Mol. Mass.:43663.67
Organism:Toxoplasma gondii
Description:ChEMBL_1290812
Residue:417
BDBM50392117
NameBDBM50392117
Synonyms:CHEMBL1945507
TypeSmall organic molecule
Emp. Form.C16H14Cl2N2
Mol. Mass.305.202
SMILESCc1cc2ncn(Cc3ccc(Cl)c(Cl)c3)c2cc1C