Reaction Details
TargetCalcitonin gene-related peptide type 1 receptor
LigandBDBM50447327
Substrate/Competitorn/a
Meas. Tech.ChEMBL_1291533 (CHEMBL3118705)
Ki 0.020000±n/a nM
Citation Joshi, PAnderson, CBinch, HHadida, SYoo, SBergeron, DDecker, CterHaar, EMoore, JGarcia-Guzman, MTermin, A Identification of potent CNS-penetrant thiazolidinones as novel CGRP receptor antagonists. Bioorg Med Chem Lett24:845-9 (2014) 
 
Calcitonin gene-related peptide type 1 receptor
Name:Calcitonin gene-related peptide type 1 receptor
Type:Enzyme Catalytic Domain
Mol. Mass.:52980.45
Organism:Homo sapiens (Human)
Description:Q16602
Residue:461
BDBM50447327
NameBDBM50447327
Synonyms:CHEMBL3114495
TypeSmall organic molecule
Emp. Form.C38H53FN6O3S
Mol. Mass.692.929
SMILESCC(C)N1CCN(CC1)c1c(F)cccc1C1SC(CC(=O)N2CCC(CC2)N2CCc3ccccc3NC2=O)C(=O)N1CCC(C)(C)C