Reaction Details
TargetCalcitonin gene-related peptide type 1 receptor
LigandBDBM50447335
Substrate/Competitorn/a
Meas. Tech.ChEMBL_1291533 (CHEMBL3118705)
Ki 0.900000±n/a nM
Citation Joshi, PAnderson, CBinch, HHadida, SYoo, SBergeron, DDecker, CterHaar, EMoore, JGarcia-Guzman, MTermin, A Identification of potent CNS-penetrant thiazolidinones as novel CGRP receptor antagonists. Bioorg Med Chem Lett24:845-9 (2014) 
 
Calcitonin gene-related peptide type 1 receptor
Name:Calcitonin gene-related peptide type 1 receptor
Type:Enzyme Catalytic Domain
Mol. Mass.:52980.45
Organism:Homo sapiens (Human)
Description:Q16602
Residue:461
BDBM50447335
NameBDBM50447335
Synonyms:CHEMBL3114486
TypeSmall organic molecule
Emp. Form.C35H48N6O3S
Mol. Mass.632.859
SMILESCN1CCN(CC1)c1ccccc1[C@@H]1S[C@H](CC(=O)N2CCC(CC2)N2Cc3ccccc3NC2=O)C(=O)N1CCC(C)(C)C